{"text_format":"1","workbook":"xlsx","n_sheets":11,"sheets":["FRData","LINData","Route Creator","FRCert","LINCert","SLINCert","FRRaw","LINRaw","Linfit Worksheet","RouteRaw","VersionInfo"],"not_rendered":{"charts":3,"images":1,"macros":1,"external_links":1,"defined_names":60,"comments":1,"pivot_tables":0},"unopened":[],"bounds":{"document_bytes":16777216,"sheet_cells":100000,"rows_first":2000,"rows_last":500,"rows_between":2000,"halvings":0,"cell_chars":16384,"cell_head_chars":4096},"cells_cut":0,"cells_raw":0,"read":"whole","date_system":"1900"}

{"sheet":"FRData","index":0,"n_rows":42,"n_cols":5,"rows_kept":42,"cut":false,"hidden":false,"merged":[[10,7,10,8],[9,0,9,3],[1,6,1,7],[0,6,0,7]]}
[null,null,null,null,"Create Calibration Certificate"]
[null,null,null,null,"in pC/g (mV/g data only)"]
[null,null,"Hardy Shaker - Calibration Unit"]
[null,null,"Report Generation Spreadsheet"]
[null,null,{"$f":"'Linfit Worksheet'!L29","v":"Version: 3.0.7"}]
[]
[]
["Enter Reference Frequency",100]
[null,{"$f":"IF($A$12=\"\",\"\",$A$12)","v":""},null,{"$f":"IF($D$8=\"\",\"\",\"mV/pC\")","v":""}]
["Frequency Response Data Table"]
["Frequency","Amplitude","Sensitivity","Deviation"]
[{"$f":"IF(FRRaw!C13<>\"\",FRRaw!C13,\"\")","v":""},{"$f":"IF(FRRaw!G13<>\"\",FRRaw!G13,\"\")","v":""},{"$f":"IF(AND(FRRaw!I12, FRRaw!E13 = \"mV/g\"),\"pC/g\",FRRaw!E13)","v":0},"%"]
[{"$f":" IF(FRRaw!B13>0,FRRaw!B13,\"\")","v":""},{"$f":"IF(FRRaw!B13>0,FIXED(FRRaw!F13,2),\"\")","v":""},{"$f":"IF((AND(FRRaw!$I$12, FRRaw!$E$13 = \"mV/g\")), IF(FRRaw!B13,( IF(FRRaw!B13,FRRaw!D13,\"\")/FRData!$D$8), \"\"), IF(FRRaw!B13,FRRaw!D13,\"\"))","v":""},{"$f":"IF(A13=\"\",\"\",100*(C13/VLOOKUP($B$8,FRData!$A$13:$C$42,3,0.01)-1))","v":""}]
[{"$f":" IF(FRRaw!B14>0,FRRaw!B14,\"\")","v":""},{"$f":"IF(FRRaw!B14>0,FIXED(FRRaw!F14,2),\"\")","v":""},{"$f":"IF((AND(FRRaw!$I$12, FRRaw!$E$13 = \"mV/g\")), IF(FRRaw!B14,( IF(FRRaw!B14,FRRaw!D14,\"\")/FRData!$D$8), \"\"), IF(FRRaw!B14,FRRaw!D14,\"\"))","v":""},{"$f":"IF(A14=\"\",\"\",100*(C14/VLOOKUP($B$8,FRData!$A$13:$C$42,3,0.01)-1))","v":""}]
[{"$f":" IF(FRRaw!B15>0,FRRaw!B15,\"\")","v":""},{"$f":"IF(FRRaw!B15>0,FIXED(FRRaw!F15,2),\"\")","v":""},{"$f":"IF((AND(FRRaw!$I$12, FRRaw!$E$13 = \"mV/g\")), IF(FRRaw!B15,( IF(FRRaw!B15,FRRaw!D15,\"\")/FRData!$D$8), \"\"), IF(FRRaw!B15,FRRaw!D15,\"\"))","v":""},{"$f":"IF(A15=\"\",\"\",100*(C15/VLOOKUP($B$8,FRData!$A$13:$C$42,3,0.01)-1))","v":""}]
{"$rows_left_out":28}
{"sheet":"LINData","index":1,"n_rows":43,"n_cols":11,"rows_kept":43,"cut":false,"hidden":false,"merged":[[11,0,12,0],[11,6,12,6],[9,0,9,4],[9,6,9,10]]}
[]
[]
[null,null,null,"Hardy Shaker - Calibration Unit",null,null,"1) Enter units for displacement and output"]
[null,null,null,"Report Generation Spreadsheet"]
[null,null,null,{"$f":"'Linfit Worksheet'!L29","v":"Version: 3.0.7"},null,null,"2) Enter measured data"]
[]
[null,false]
[]
[]
["Dynamic Linearity Data Table",null,null,null,null,null,"Static Proximity Probe / 4-20 mA Vibration Sensor Calibration Data Table"]
[" Test Frequency:",{"$f":"IF(LINRaw!B13<>\"\",LINRaw!B13,\"\")","v":""},{"$f":"IF(LINRaw!C13<>\"\",LINRaw!C13,\"\")","v":""},"Max Linearity:",{"$f":"FIXED(MAX('Linfit Worksheet'!G4:G19),2)&\" %\"","v":"0.00 %"},null,null,null,null,"Max Linearity:",{"$f":"IF(K15<>\"\",FIXED(MAX(K15:K39)*100,2),\"0.00\")&\" %\"","v":"0.00 %"}]
["Index","Input","Output","Sensitivity","Linearity",null,"Index","Displacement","Output","Sensitivity","Linearity"]
[null,{"$f":"IF(LINRaw!G13<>\"\",LINRaw!G13,\"\")","v":""},{"$f":"IF(D13<>0,LEFT(D13,FIND(\"/\",D13,1)-1),\"\")","v":""},{"$f":"LINRaw!E13","v":0},"%",null,null,"mil p-p","mV",{"$f":"I13&\"/\"&'Linfit Worksheet'!AD1","v":"mV/mil"},"%"]
[1,{"$f":"IF(LINRaw!B13>0,LINRaw!F13,\"\")","v":""},{"$f":"IF(B14<>\"\",D14*B14,\"\")","v":""},{"$f":"IF(LINRaw!B13>0,LINRaw!D13,\"\")","v":""},{"$f":"'Linfit Worksheet'!F4","v":""},null,"Starting Point"]
[2,{"$f":"IF(LINRaw!B14>0,LINRaw!F14,\"\")","v":""},{"$f":"IF(B15<>\"\",D15*B15,\"\")","v":""},{"$f":"IF(LINRaw!B14>0,LINRaw!D14,\"\")","v":""},{"$f":"'Linfit Worksheet'!F5","v":""},null,1,null,null,{"$f":"IF(H15<>\"\",IF(I15<>\"\",(I15-I14)/(H15-H14),\"\"),\"\")","v":""},{"$f":"IF(H15<>\"\",IF(I15<>\"\",'Linfit Worksheet'!N3,\"\"),\"\")","v":""}]
{"$rows_left_out":29}
{"sheet":"Route Creator","index":2,"n_rows":11,"n_cols":6,"rows_kept":11,"cut":false,"hidden":false,"merged":[[10,5,11,5],[10,0,11,0],[10,1,11,1],[10,2,11,2],[10,3,11,3],[10,4,11,4]]}
[]
[]
[null,null,"Hardy Shaker - Calibration Unit"]
[null,null,"Calibration Route Generation Spreadsheet"]
[null,null,{"$f":"'Linfit Worksheet'!L29","v":"Version: 3.0.7"}]
[]
["Route Name",null,"Amplitude Unit",null,"Sensor Type"]
["Frequency Unit",null,"Lower Bound",null,"Sensor MN"]
["Amplitude",null,"Upper Bound"]
[]
["Frequency","Amplitude","Amplitude Unit","Lower Bound","Upper Bound","Sensor Type"]

{"sheet":"FRCert","index":3,"n_rows":57,"n_cols":12,"rows_kept":57,"cut":false,"hidden":false,"merged":[[55,8,55,9],[41,5,41,11],[56,8,56,9],[43,5,43,11],[44,5,44,11],[45,5,45,11],[46,5,46,11],[47,8,47,9],[48,8,48,9],[39,5,39,11],[40,5,40,11],[42,5,42,11],[49,8,49,9],[54,8,54,9],[36,5,36,11],[37,5,37,11],[38,5,38,11],[9,2,9,3],[10,1,10,3],[11,1,11,3],[24,1,24,11],[10,5,10,6],[11,5,11,6],[12,5,12,6],[13,5,13,6],[16,4,17,4],[18,5,18,6],[16,5,16,6],[17,5,17,6],[35,5,35,11],[12,1,12,3],[1,1,1,11],[4,4,4,5],[8,2,8,5],[4,2,4,3],[5,2,5,3],[6,2,6,3],[7,2,7,3]]}
[]
[null,"~ Calibration Certificate ~"]
[]
[null,"Sensor Information:",null,null,"Calibration Data",null,null,null,"Transducer Specifications"]
[null,"Model Number",{"$f":"IF(FRRaw!A5<>\"\",FRRaw!A5,\"\")","v":""},null,{"$f":"\"Sensitivity @ \"&VLOOKUP(FRData!B8,FRData!A13:A42,1)&\" \"&FRData!B9&\":\"","v":{"$error":"#N/A"}},null,{"$f":"VLOOKUP(FRData!B8,FRData!A13:D42,3)","v":{"$error":"#N/A"}},{"$f":"FRData!C12","v":0},"Amp. Range:",null,null,"g"]
[null,"Serial Number",{"$f":"IF(FRRaw!B5<>\"\",FRRaw!B5,\"\")","v":""},null,"Test Level:",null,{"$f":"FIXED(VLOOKUP(FRData!B8,FRData!A13:D42,2),2)","v":{"$error":"#N/A"}},{"$f":"FRData!B12","v":""},"Resolution:",null,null,"g"]
[null,"Manufacturer",null,null,{"$f":"IF(FRRaw!I12,\"Inline Charge Amp\",\"\")","v":""},null,null,null,"Resonant Freq:",null,null,"Hz"]
[null,"ID Number",null,null,{"$f":"IF(FRRaw!I12,\"Sensitivity:\",\"\")","v":""},null,{"$f":"IF(FRRaw!I12,FRData!D8,\"\")","v":""},{"$f":"IF(FRRaw!I12,\"mV/pC\",\"\")","v":""},"Temp. Range:",null,null,"oC"]
[null,"Description",null,null,null,null,null,null,{"$f":"IF(FRRaw!C5<>\"\",\"Axis:\",\"\")","v":""},null,{"$f":"IF(FRRaw!C5<>\"\",FRRaw!C5,\"\")","v":""}]
[]
[]
[]
[]
[]
[]
{"$rows_left_out":43}
{"sheet":"LINCert","index":4,"n_rows":57,"n_cols":28,"rows_kept":57,"cut":false,"hidden":false,"merged":[[49,4,49,6],[48,4,48,6],[51,1,51,3],[51,4,51,6],[51,7,51,9],[55,24,55,28],[55,20,55,23],[56,20,56,23],[56,24,56,28],[55,14,55,19],[52,7,52,9],[56,1,56,3],[56,4,56,6],[56,7,56,9],[55,7,55,9],[55,11,55,13],[55,1,55,3],[55,4,55,6],[53,4,53,6],[54,14,54,19],[54,11,54,13],[52,1,52,3],[52,4,52,6],[53,1,53,3],[33,11,33,28],[47,7,47,9],[41,1,41,3],[36,1,36,3],[39,7,39,9],[49,1,49,3],[48,1,48,3],[54,20,54,23],[54,24,54,28],[42,1,42,3],[43,1,43,3],[53,7,53,9],[54,1,54,3],[54,4,54,6],[54,7,54,9],[50,1,50,3],[50,4,50,6],[50,7,50,9],[46,1,46,3],[45,1,45,3],[45,4,45,6],[45,7,45,9],[48,7,48,9],[49,7,49,9],[47,24,47,25],[46,4,46,6],[46,7,46,9],[42,4,42,6],[44,7,44,9],[42,7,42,9],[44,1,44,3],[47,1,47,3],[47,20,47,23],[47,4,47,6],[43,4,43,6],[44,4,44,6],[43,7,43,9],[28,7,28,9],[30,7,30,9],[41,4,41,6],[39,4,39,6],[28,4,28,6],[29,4,29,6],[31,1,31,3],[37,1,37,3],[35,1,35,3],[30,1,30,3],[37,4,37,6],[33,1,33,3],[35,4,35,6],[32,4,32,6],[38,4,38,6],[36,4,36,6],[40,1,40,3],[34,1,34,3],[34,4,34,6],[32,1,32,3],[40,7,40,9],[40,4,40,6],[41,7,41,9],[1,0,1,28],[3,1,3,5],[3,9,3,13],[8,9,8,13],[8,14,8,16],[3,21,3,27],[4,21,4,23],[5,1,5,3],[4,14,4,16],[4,4,4,8],[6,1,6,3],[6,4,6,8],[7,4,7,8],[6,9,6,13],[6,17,6,19],[7,1,7,3],[4,24,4,26],[7,27,7,28],[7,17,7,19],[7,9,7,13],[7,14,7,16],[4,27,4,28],[5,21,5,23],[8,27,8,28],[6,27,6,28],[5,24,5,26],[5,27,5,28],[6,14,6,16],[4,17,4,19],[26,1,26,3],[25,1,25,4],[29,1,29,3],[28,1,28,3],[27,1,27,3],[7,21,7,23],[7,24,7,26],[29,7,29,9],[8,24,8,26],[27,11,27,28],[26,11,26,12],[8,17,8,19],[10,0,24,28],[8,21,8,23],[26,7,26,9],[27,4,27,6],[27,7,27,9],[26,4,26,6],[9,1,9,7],[40,11,40,13],[42,11,42,13],[43,11,43,13],[6,21,6,23],[6,24,6,26],[4,1,4,3],[4,9,4,13],[5,17,5,19],[5,4,5,8],[5,14,5,16],[32,11,32,28],[36,7,36,9],[34,7,34,9],[37,7,37,9],[32,7,32,9],[35,7,35,9],[33,7,33,9],[38,7,38,9],[31,7,31,9],[39,1,39,3],[30,4,30,6],[31,4,31,6],[38,1,38,3],[33,4,33,6],[41,14,41,28],[42,14,42,28],[43,14,43,28],[44,11,44,13],[45,11,45,13],[28,11,28,28],[29,11,29,28],[30,11,30,28],[31,11,31,28],[34,11,34,28],[35,14,35,28],[41,11,41,13],[45,14,45,28],[44,14,44,28],[36,14,36,28],[37,14,37,28],[38,14,38,28],[39,14,39,28],[40,14,40,28],[35,11,35,13],[36,11,36,13],[37,11,37,13],[38,11,38,13],[39,11,39,13]]}
[]
["~ Linearity Certificate ~"]
[]
[null,"Sensor Information",null,null,null,null,null,null,null,"Calibration Data",null,null,null,null,null,null,null,null,null,null,null,"Transducer Specifications"]
[null,"Model Number:",null,null,{"$f":"IF(LINRaw!A5=\"\",\"\",LINRaw!A5)","v":""},null,null,null,null,"Sensitivity @ Test Freq.:",null,null,null,null,{"$f":"IF('Linfit Worksheet'!B7<1,FIXED('Linfit Worksheet'!B7,3),FIXED('Linfit Worksheet'!B7,3))","v":{"$error":"#VALUE!"}},null,null,{"$f":"LINData!$D$13","v":0},null,null,null,"Amp. Range:",null,null,null,null,null,{"$f":"MeasurementRangeUnits","v":"g"}]
[null,"Serial Number:",null,null,{"$f":"IF(LINRaw!B5=\"\",\"\",LINRaw!B5)","v":""},null,null,null,null,null,null,null,null,null,null,null,null,null,null,null,null,{"$f":"IF(MeasurementResolution<0.000000001,\"\",\"Resolution:\")","v":"Resolution:"},null,null,null,null,null,{"$f":"IF(MeasurementResolution<0.000000001,\"\",MeasurementResolutionUnits)","v":"g"}]
[null,"Manufacturer:",null,null,null,null,null,null,null,"Test Frequency",null,null,null,null,{"$f":"LINData!$B$11","v":""},null,null,{"$f":"LINData!$C$11","v":""},null,null,null,"Resonant Freq:",null,null,null,null,null,"Hz"]
[null,"ID Number:",null,null,null,null,null,null,null,null,null,null,null,null,null,null,null,null,null,null,null,"Temp. Range:",null,null,null,null,null,"oC"]
[null,null,null,null,null,null,null,null,null,"Linearity:",null,null,null,null,{"$f":"FIXED(LINData!$E$11*100,2)","v":"0.00"},null,null,"%",null,null,null,{"$f":"IF(LINRaw!C5<>\"\",\"Axis:\",\"\")","v":""},null,null,{"$f":"IF(LINRaw!C5<>\"\",LINRaw!C5,\"\")","v":""}]
[null,"Amplitude Linearity"]
[]
[]
[]
[]
[]
{"$rows_left_out":43}
{"sheet":"SLINCert","index":5,"n_rows":54,"n_cols":28,"rows_kept":54,"cut":false,"hidden":false,"merged":[[1,0,1,28],[3,1,3,5],[3,9,3,13],[3,21,3,27],[4,1,4,3],[4,4,4,8],[4,9,4,13],[4,14,4,16],[46,11,46,13],[5,24,5,26],[5,21,5,23],[4,21,4,23],[4,24,4,26],[5,17,5,19],[5,27,5,28],[4,27,4,28],[5,1,5,3],[5,14,5,16],[5,4,5,8],[4,17,4,19],[6,27,6,28],[7,24,7,26],[6,24,6,26],[6,17,6,19],[52,24,52,28],[35,14,35,28],[36,14,36,28],[37,14,37,28],[38,14,38,28],[39,14,39,28],[40,14,40,28],[41,14,41,28],[42,14,42,28],[47,20,47,23],[43,14,43,28],[44,14,44,28],[46,14,46,19],[51,24,51,28],[51,20,51,23],[52,20,52,23],[46,24,46,25],[47,24,47,25],[46,20,46,23],[7,9,7,13],[33,7,33,9],[7,27,7,28],[7,17,7,19],[7,21,7,23],[9,1,9,7],[6,4,6,8],[6,21,6,23],[6,14,6,16],[6,1,6,3],[6,9,6,13],[7,1,7,3],[7,14,7,16],[7,4,7,8],[32,7,32,9],[32,11,32,28],[8,14,8,16],[8,17,8,19],[8,21,8,23],[30,11,30,28],[29,1,29,3],[27,4,28,6],[27,1,28,3],[32,1,32,3],[8,27,8,28],[27,7,28,9],[27,11,27,28],[28,11,28,28],[8,24,8,26],[8,9,8,13],[29,7,29,9],[38,1,38,3],[38,4,38,6],[38,7,38,9],[35,7,35,9],[37,1,37,3],[33,11,33,28],[34,11,34,28],[31,11,31,28],[10,0,24,28],[26,1,26,4],[26,11,26,12],[30,1,30,3],[30,4,30,6],[30,7,30,9],[29,11,29,28],[31,1,31,3],[29,4,29,6],[41,1,41,3],[41,4,41,6],[41,7,41,9],[40,11,40,13],[43,1,43,3],[43,4,43,6],[43,7,43,9],[44,1,44,3],[44,4,44,6],[44,7,44,9],[40,4,40,6],[40,7,40,9],[40,1,40,3],[42,1,42,3],[42,4,42,6],[42,7,42,9],[31,4,31,6],[31,7,31,9],[37,4,37,6],[37,7,37,9],[33,1,33,3],[33,4,33,6],[35,1,35,3],[39,1,39,3],[39,4,39,6],[39,7,39,9],[34,1,34,3],[34,4,34,6],[34,7,34,9],[35,4,35,6],[36,1,36,3],[36,4,36,6],[36,7,36,9],[32,4,32,6],[47,1,47,3],[47,4,47,6],[47,7,47,9],[47,14,47,19],[45,1,45,3],[45,4,45,6],[45,7,45,9],[46,1,46,3],[46,4,46,6],[46,7,46,9],[47,11,47,13],[49,1,49,3],[49,4,49,6],[49,7,49,9],[48,1,48,3],[48,4,48,6],[48,7,48,9],[50,1,50,3],[50,4,50,6],[50,7,50,9],[52,11,52,13],[52,14,52,19],[51,11,51,13],[51,14,51,19],[51,1,51,3],[51,4,51,6],[51,7,51,9],[53,1,53,3],[53,4,53,6],[53,7,53,9],[52,1,52,3],[52,4,52,6],[52,7,52,9]]}
[]
["~ Linearity Certificate ~"]
[]
[null,"Sensor Information",null,null,null,null,null,null,null,"Calibration Data",null,null,null,null,null,null,null,null,null,null,null,"Transducer Specifications"]
[null,"Model Number:",null,null,null,null,null,null,null,"Sensitivity:",null,null,null,null,{"$f":"IF('Linfit Worksheet'!J12<>\"\",FIXED(ABS('Linfit Worksheet'!J12),3),\"\")","v":""},null,null,{"$f":"'Linfit Worksheet'!L2&\"/\"&'Linfit Worksheet'!K2","v":"mV/mil p-p"},null,null,null,"Amp. Range:",null,null,null,null,null,{"$f":"MeasurementRangeUnits","v":"g"}]
[null,"Serial Number:",null,null,null,null,null,null,null,null,null,null,null,null,null,null,null,null,null,null,null,{"$f":"IF(MeasurementResolution<0.000000001,\"\",\"Resolution:\")","v":"Resolution:"},null,null,null,null,null,{"$f":"IF(MeasurementResolution<0.000000001,\"\",MeasurementResolutionUnits)","v":"g"}]
[null,"Manufacturer:",null,null,null,null,null,null,null,"Linearity:",null,null,null,null,{"$f":"IF(LINData!K11<>\"\",FIXED(LINData!K11*100,2),\"\")","v":"0.00"},null,null,"%",null,null,null,"Resonant Freq:",null,null,null,null,null,{"$f":"ResonantFrequencyUnits","v":"Hz"}]
[null,"ID Number:",null,null,null,null,null,null,null,null,null,null,null,null,null,null,null,null,null,null,null,"Temp. Range:",null,null,null,null,null,"oC"]
[]
[null,"Amplitude Linearity"]
[]
[]
[]
[]
[]
{"$rows_left_out":40}
{"sheet":"FRRaw","index":6,"n_rows":12,"n_cols":9,"rows_kept":12,"cut":false,"hidden":true,"merged":[]}
[]
[]
[]
[]
[]
[]
[]
[]
[]
[]
[]
[null,null,null,null,null,null,null,null,false]

{"sheet":"LINRaw","index":7,"n_rows":0,"n_cols":0,"rows_kept":0,"cut":false,"hidden":true,"merged":[]}

{"sheet":"Linfit Worksheet","index":8,"n_rows":33,"n_cols":30,"rows_kept":33,"cut":false,"hidden":true,"merged":[[0,0,0,7],[28,9,28,10],[28,11,28,12]]}
["PLEASE DO NOT DELETE THIS TABLE (USED FOR LINEARITY CALCULATION)",null,null,null,null,null,null,null,null,null,"Test Level",null,"Linfit","Linearity",null,null,null,null,null,null,null,"Acceleration","g pk","in/s pk","mil p-p","V","g pk","g",{"$f":"LINData!H13","v":"mil p-p"},{"$f":"LOOKUP('Linfit Worksheet'!AC1,VibeUnits,SensUnits)","v":"mil"}]
["For Dynamic Linearity",null,"test level","mVpk","linfit (mVpk)","linearity %FS","Absolute","zero line",null,"For Static Linearity",{"$f":"LINData!H13","v":"mil p-p"},{"$f":"LINData!I13","v":"mV"},{"$f":"L2","v":"mV"},"%",null,null,null,null,null,null,null,"Velocity","g RMS","in/s RMS","mil","mV","g RMS","g"]
[null,null,0,null,0,null,null,0,null,"SLOPE",{"$f":"IF(Q7<>\"\",Q7,\"\")","v":""},{"$f":"IF(R7<>\"\",R7,\"\")","v":""},{"$f":"IF(S7<>\"\",S7,\"\")","v":""},{"$f":"T7","v":0},null,null,{"$f":"IF(K3<>\"\",ABS(L3/M3-1),\"\")","v":""},null,null,null,null,"Displacement","m/s2 pk","mm/s pk","um p-p","mA","in/s pk","in/s"]
["Slope:",{"$f":"LINEST(D4:D4,C4:C4,TRUE)","v":{"$error":"#VALUE!"}},{"$f":"IF(LINData!B14>0,IF(LINData!C14>0,LINData!B14,\"\"),\"\")","v":""},{"$f":"IF(LINData!B14>0,IF(LINData!C14>0,LINData!C14,\"\"),\"\")","v":""},{"$f":"IF(C4<>\"\",IF(D4<>\"\",$B$9*C4+$B$10,\"\"),\"\")","v":""},{"$f":"IF(C4<>\"\",IF(D4<>\"\",(D4-E4)/$B$5*100,\"\"),\"\")","v":""},{"$f":"IF(C4<>\"\",IF(D4<>\"\",ABS(F4),\"\"),\"\")","v":""},{"$f":"IF(C4<>\"\",IF(D4<>\"\",0,\"\"),\"\")","v":""},null,{"$f":"INDEX(LINEST(LINData!I14:I15,LINData!H14:H15,TRUE),1,1)","v":{"$error":"#VALUE!"}},{"$f":"IF(Q8<>\"\",Q8,\"\")","v":""},"","",{"$f":"T8","v":""},null,null,null,null,null,null,null,null,"m/s2 RMS","mm/s RMS","um","uA","in/s RMS","in/s"]
["FS linfit (mVpk)",null,{"$f":"IF(LINData!B15>0,IF(LINData!C15>0,LINData!B15,\"\"),\"\")","v":""},{"$f":"IF(LINData!B15>0,IF(LINData!C15>0,LINData!C15,\"\"),\"\")","v":""},{"$f":"IF(C5<>\"\",IF(D5<>\"\",$B$9*C5+$B$10,\"\"),\"\")","v":""},{"$f":"IF(C5<>\"\",IF(D5<>\"\",(D5-E5)/$B$5*100,\"\"),\"\")","v":""},{"$f":"IF(C5<>\"\",IF(D5<>\"\",ABS(F5),\"\"),\"\")","v":""},{"$f":"IF(C5<>\"\",IF(D5<>\"\",0,\"\"),\"\")","v":""},null,"INTERCEPT",{"$f":"IF(Q9<>\"\",Q9,\"\")","v":""},"","",{"$f":"T9","v":""},null,null,"Test Level",null,"Linfit","Linearity",null,null,null,null,null,null,"m/s2 pk","m/s2"]
["max linearity",{"$f":"MAX(G4:G13)","v":0},{"$f":"IF(LINData!B16>0,IF(LINData!C16>0,LINData!B16,\"\"),\"\")","v":""},{"$f":"IF(LINData!B16>0,IF(LINData!C16>0,LINData!C16,\"\"),\"\")","v":""},"","","","",null,{"$f":"INDEX(LINEST(LINData!I14:I15,LINData!H14:H15,TRUE),1,2)","v":{"$error":"#VALUE!"}},{"$f":"IF(Q10<>\"\",Q10,\"\")","v":""},"","","",null,"Point",{"$f":"LINData!H13","v":"mil p-p"},{"$f":"LINData!I13","v":"mV"},{"$f":"L2","v":"mV"},"%",null,null,null,null,null,null,"m/s2 RMS","m/s2"]
[{"$f":"\"Sensitivity (\"&LINData!B11&\")\"","v":"Sensitivity ()"},{"$f":"$B$4","v":{"$error":"#VALUE!"}},{"$f":"IF(LINData!B17>0,IF(LINData!C17>0,LINData!B17,\"\"),\"\")","v":""},{"$f":"IF(LINData!B17>0,IF(LINData!C17>0,LINData!C17,\"\"),\"\")","v":""},"","","","",null,"ymax",{"$f":"IF(Q11<>\"\",Q11,\"\")","v":""},"","","",null,"Reference",{"$f":"IF(LINData!H14<>\"\",LINData!H14,\"\")","v":""},{"$f":"IF(LINData!I14<>\"\",LINData!I14,\"\")","v":""},{"$f":"IF(Q7<>\"\",Q7*$J$4+$J$6,\"\")","v":""},null,null,null,null,null,null,null,"mil","mil"]
[null,null,{"$f":"IF(LINData!B18>0,IF(LINData!C18>0,LINData!B18,\"\"),\"\")","v":""},{"$f":"IF(LINData!B18>0,IF(LINData!C18>0,LINData!C18,\"\"),\"\")","v":""},"","","","",null,{"$f":"MAX(L3:L27)","v":0},{"$f":"IF(Q12<>\"\",Q12,\"\")","v":""},"","","",null,1,{"$f":"IF(LINData!H15<>\"\",LINData!H15,\"\")","v":""},{"$f":"IF(LINData!I15<>\"\",LINData!I15,\"\")","v":""},{"$f":"IF(Q8<>\"\",Q8*$J$4+$J$6,\"\")","v":""},{"$f":"IF(Q8<>\"\",ABS(R8/S8-1),\"\")","v":""},null,null,null,null,null,null,"mil p-p","mil"]
["Slope:",{"$f":"INDEX(LINEST(D4:D4,C4:C4,TRUE),1,1)","v":{"$error":"#VALUE!"}},{"$f":"IF(LINData!B19>0,IF(LINData!C19>0,LINData!B19,\"\"),\"\")","v":""},{"$f":"IF(LINData!B19>0,IF(LINData!C19>0,LINData!C19,\"\"),\"\")","v":""},"","","","",null,"xmax",{"$f":"IF(Q13<>\"\",Q13,\"\")","v":""},"","","",null,2,{"$f":"IF(LINData!H16<>\"\",LINData!H16,\"\")","v":""},{"$f":"IF(LINData!I16<>\"\",LINData!I16,\"\")","v":""},"",{"$f":"IF(Q9<>\"\",ABS(R9/S9-1),\"\")","v":""},null,null,null,null,null,null,"mm/s pk","mm/s"]
["Y-Intercept",{"$f":"INDEX(LINEST(D4:D4,C4:C4,TRUE),1,2)","v":{"$error":"#VALUE!"}},{"$f":"IF(LINData!B20>0,IF(LINData!C20>0,LINData!B20,\"\"),\"\")","v":""},{"$f":"IF(LINData!B20>0,IF(LINData!C20>0,LINData!C20,\"\"),\"\")","v":""},"","","","",null,{"$f":"MAX(K3:K27)","v":0},{"$f":"IF(Q14<>\"\",Q14,\"\")","v":""},"","","",null,3,{"$f":"IF(LINData!H17<>\"\",LINData!H17,\"\")","v":""},{"$f":"IF(LINData!I17<>\"\",LINData!I17,\"\")","v":""},"","",null,null,null,null,null,null,"mm/s RMS","mm/s"]
["xMax",{"$f":"MAX(C3:C33)","v":0},{"$f":"IF(LINData!B21>0,IF(LINData!C21>0,LINData!B21,\"\"),\"\")","v":""},{"$f":"IF(LINData!B21>0,IF(LINData!C21>0,LINData!C21,\"\"),\"\")","v":""},"","","","",null,"sensitivity",{"$f":"IF(Q15<>\"\",Q15,\"\")","v":""},"","","",null,4,{"$f":"IF(LINData!H18<>\"\",LINData!H18,\"\")","v":""},{"$f":"IF(LINData!I18<>\"\",LINData!I18,\"\")","v":""},"","",null,null,null,null,null,null,"um","um"]
["yMax",{"$f":"MAX(D4:E33)","v":0},{"$f":"IF(LINData!B22>0,IF(LINData!C22>0,LINData!B22,\"\"),\"\")","v":""},{"$f":"IF(LINData!B22>0,IF(LINData!C22>0,LINData!C22,\"\"),\"\")","v":""},"","","","",null,{"$f":"IF(Q7<>\"\",J4,\"\")","v":""},{"$f":"IF(Q16<>\"\",Q16,\"\")","v":""},"",{"$f":"IF(S17<>\"\",S17-$S$7,\"\")","v":""},"",null,5,{"$f":"IF(LINData!H19<>\"\",LINData!H19,\"\")","v":""},{"$f":"IF(LINData!I19<>\"\",LINData!I19,\"\")","v":""},"","",null,null,null,null,null,null,"um p-p","um",null,false]
["xMin",{"$f":"MIN(C4:C33)","v":0},{"$f":"IF(LINData!B23>0,IF(LINData!C23>0,LINData!B23,\"\"),\"\")","v":""},{"$f":"IF(LINData!B23>0,IF(LINData!C23>0,LINData!C23,\"\"),\"\")","v":""},"","","","",null,null,{"$f":"IF(Q17<>\"\",Q17,\"\")","v":""},"","","",null,6,{"$f":"IF(LINData!H20<>\"\",LINData!H20,\"\")","v":""},{"$f":"IF(LINData!I20<>\"\",LINData!I20,\"\")","v":""},"",""]
[null,null,{"$f":"IF(LINData!B24>0,IF(LINData!C24>0,LINData!B24,\"\"),\"\")","v":""},{"$f":"IF(LINData!B24>0,IF(LINData!C24>0,LINData!C24,\"\"),\"\")","v":""},"","","","",null,null,{"$f":"IF(Q18<>\"\",Q18,\"\")","v":""},"","","",null,7,{"$f":"IF(LINData!H21<>\"\",LINData!H21,\"\")","v":""},{"$f":"IF(LINData!I21<>\"\",LINData!I21,\"\")","v":""},"",""]
[null,null,{"$f":"IF(LINData!B25>0,IF(LINData!C25>0,LINData!B25,\"\"),\"\")","v":""},{"$f":"IF(LINData!B25>0,IF(LINData!C25>0,LINData!C25,\"\"),\"\")","v":""},"","","","",null,null,{"$f":"IF(Q19<>\"\",Q19,\"\")","v":""},"","","",null,8,{"$f":"IF(LINData!H22<>\"\",LINData!H22,\"\")","v":""},{"$f":"IF(LINData!I22<>\"\",LINData!I22,\"\")","v":""},"",""]
{"$rows_left_out":19}
{"sheet":"RouteRaw","index":9,"n_rows":12,"n_cols":4,"rows_kept":12,"cut":false,"hidden":true,"merged":[]}
["Frequency Units","Sensor Type","Amplitude Units","filenames"]
["Hertz",null,null,"pvc_route"]
["CPM","ICP","g pk","pvc_route2"]
[null,"Voltage","g RMS","pvc_route3"]
[null,"Modulated Current","in/s pk"]
[null,null,"in/s RMS"]
[null,null,"mil p-p"]
[null,null,"m/s2 pk"]
[null,null,"m/s2 RMS"]
[null,null,"mm/s pk"]
[null,null,"mm/s RMS"]
[null,null,"um p-p"]

{"sheet":"VersionInfo","index":10,"n_rows":28,"n_cols":5,"rows_kept":28,"cut":false,"hidden":true,"merged":[[21,4,25,14],[27,4,31,14],[0,0,0,2],[7,4,13,14],[4,4,5,14],[2,4,2,14],[15,4,19,14]]}
["Current Report Workbook Version:",null,null,{"$f":"'Linfit Worksheet'!L29","v":"Version: 3.0.7"}]
[]
["Version:","2.0.2",null,"Description:","Introduced Version Log"]
[]
["Version:","2.0.3",null,"Description:","Edited the Route Creator sheet.  The decimal place of the amplitude value is now limited based on the selected amplitude unit."]
[]
[]
["Version","3.0.0",null,"Description:","In LINData: unlocked H12 and created a drop down menu for acceleration, velocity, and displacement.  Modified H13 and created a linked list for the amplitude, velocity and displacement options available on the PVC.  Modified I13 and created a drop down list for Volts and mA.  Got rid of line 14 (was called \"starting point\").\nChanged the name of table in G10 to \"Static Proximity Probe/4-20 mA Vibration Sensor Calibration Data Table\" (did not record original name).  In FRData: Added checkbox at top right to allow the inline charge amp sensitivity to be displayed.  Added the charge amp sensitivity text box.  The charge amp sensitivity is now displayed on the Cal Cert."]
[]
[]
[]
[]
[]
[]
[]
{"$rows_left_out":13}